BDBM50438285 CHEMBL2408578
SMILES CCCC1CC(=O)c2cnc(Nc3ccc(Cl)cc3)nc2C1
InChI Key InChIKey=TTYIEQPWSVCGEY-UHFFFAOYSA-N
Data  1 IC50
  Tab Delimited (TSV)   2D SDfile   Computed 3D by Vconf -m prep SDfile
Find this compound or compounds like it in BindingDB:
Activity Spreadsheet -- Enzyme Inhibition Constant Data from BindingDB
Found 1 hit for monomerid = 50438285
TargetMetabotropic glutamate receptor 5(Homo sapiens (Human))
Merz Pharmaceuticals
Curated by ChEMBL
LigandPNGBDBM50438285(CHEMBL2408578)
Affinity DataIC50: >1.00E+5nM. Assay description: Negative allosteric modulation of human mGluR5 expressed in CHO cells assessed as inhibition of L-quisqualate-induced intracellular cAMP accumulation...
In DepthDetails ArticlePubMed